Does not match input value

[[‘InputLayer’, [(None, 30, 37)], 0], [‘InputLayer’, [(None, 64)], 0], [‘Bidirectional’, (None, 30, 64), 17920], [‘RepeatVector’, (None, 30, 64), 0, 30], [‘Concatenate’, (None, 30, 128), 0], [‘Dense’, (None, 30, 1), 129, ‘relu’], [‘Activation’, (None, 30, 1), 0], [‘Dot’, (None, 1, 64), 0], [‘InputLayer’, [(None, 64)], 0], [‘LSTM’, [(None, 64), (None, 64), (None, 64)], 33024, [(None, 1, 64), (None, 64), (None, 64)], ‘tanh’], [‘Dense’, (None, 11), 715, ‘softmax’]]
Test failed at layer: 5
Expected value

[‘Dense’, (None, 30, 10), 1290, ‘tanh’]

does not match the input value:

[‘Dense’, (None, 30, 1), 129, ‘relu’]

AssertionError Traceback (most recent call last)
in
32
33
—> 34 modelf_test(modelf)
in modelf_test(target)
29 [‘Dense’, (None, 11), 715, ‘softmax’]]
30
—> 31 comparator(summary(model), expected_summary)
32
33

~/work/W3A1/test_utils.py in comparator(learner, instructor)
25 “\n\n does not match the input value: \n\n”,
26 colored(f"{a}", “red”))
—> 27 raise AssertionError(“Error in test”)
28 layer += 1
29 print(colored(“All tests passed!”, “green”))

AssertionError: Error in test

This post has been answered in other thread.